Target
Sphingosine 1-phosphate receptor 2
Ligand
BDBM41621
Substrate
Meas. Tech.
Counterscreen for S1P2 Antagonists: Dose Response Cell-Based Screen to Identify Antagonists of CRE-BLA
IC50
>40000±n/a nM
Citation
 PubChem, PC Counterscreen for S1P2 Antagonists: Dose Response Cell-Based Screen to Identify Antagonists of CRE-BLA PubChem Bioassay (2008)[AID] 
Target
Name:
Sphingosine 1-phosphate receptor 2
Synonyms:
EDG5 S1PR2 Sphingosine 1-phosphate receptor Sphingosine-1-phosphate receptor 2 | ndothelial differentiation G-protein coupled receptor 5
Type:
G Protein-Coupled Receptor (GPCR)
Mol. Mass.:
38883.16
Organism:
Homo sapiens (Human)
Description:
Membranes isolated from S1P2-transfected CHO cells were used in ligand binding assay.
Residue:
353
  
Inhibitor
Name:
BDBM41621
Synonyms:
3-(2-thienyl)-6-(trifluoromethyl)thieno[3,2-b]pyridine SR-01000759131-1 | cid_1486485
Type:
Small organic molecule
Emp. Form.:
C12H6F3NS2
Mol. Mass.:
285.308
SMILES:
FC(F)(F)c1cnc2c(csc2c1)-c1cccs1
: