Target
Sphingosine 1-phosphate receptor 2
Ligand
BDBM41648
Substrate
Meas. Tech.
Counterscreen for S1P2 Agonists: Dose Response High Throughput Cell-Based Screen to Identify Activators of CRE-BLA: S1P2 Purchased Analogues
EC50
>44000±n/a nM
Citation
 PubChem, PC Counterscreen for S1P2 Agonists: Dose Response High Throughput Cell-Based Screen to Identify Activators of CRE-BLA: S1P2 Purchased Analogues PubChem Bioassay (2007)[AID] 
Target
Name:
Sphingosine 1-phosphate receptor 2
Synonyms:
EDG5 S1PR2 Sphingosine 1-phosphate receptor Sphingosine-1-phosphate receptor 2 | ndothelial differentiation G-protein coupled receptor 5
Type:
G Protein-Coupled Receptor (GPCR)
Mol. Mass.:
38883.16
Organism:
Homo sapiens (Human)
Description:
Membranes isolated from S1P2-transfected CHO cells were used in ligand binding assay.
Residue:
353
  
Inhibitor
Name:
BDBM41648
Synonyms:
1-[2-(1-benzyl-2,5-dimethyl-pyrrol-3-yl)-2-keto-ethyl]pyrrolidine-2,5-quinone 1-[2-[2,5-dimethyl-1-(phenylmethyl)-3-pyrrolyl]-2-oxoethyl]pyrrolidine-2,5-dione MLS000057725 cid_2113511
Type:
Small organic molecule
Emp. Form.:
C19H20N2O3
Mol. Mass.:
324.3737
SMILES:
Cc1cc(C(=O)CN2C(=O)CCC2=O)c(C)n1Cc1ccccc1
: