Target
Serine/threonine-protein kinase PLK1
Ligand
BDBM41753
Substrate
Meas. Tech.
Concentration Response Redox Cycling H2O2 Generation assay, 1 mM DTT, to characterize small molecule inhibitors identified in the Polo box domain (PBD) of Plk1 Primary HTS.
EC50
>50000±n/a nM
Citation
 PubChem, PC Concentration Response Redox Cycling H2O2 Generation assay, 1 mM DTT, to characterize small molecule inhibitors identified in the Polo box domain (PBD) of Plk1 Primary HTS. PubChem Bioassay (2007)[AID] 
Target
Name:
Serine/threonine-protein kinase PLK1
Synonyms:
PLK PLK1 Polo-like kinase 1 (PlK1) STPK13 Serine/threonine-protein kinase 13 | polo-like kinase
Type:
Serine/threonine-protein kinase
Mol. Mass.:
68277.16
Organism:
Homo sapiens (Human)
Description:
P53350
Residue:
603
  
Inhibitor
Name:
BDBM41753
Synonyms:
6-(Piperidine-1-carbonyl)-cyclohex-3-enecarboxylic acid p-tolylamide MLS000071126 N-(4-methylphenyl)-6-[oxo(1-piperidinyl)methyl]-1-cyclohex-3-enecarboxamide SMR000010710 | cid_648286
Type:
Small organic molecule
Emp. Form.:
C20H26N2O2
Mol. Mass.:
326.4326
SMILES:
Cc1ccc(NC(=O)C2CC=CCC2C(=O)N2CCCCC2)cc1
: