Target
Serine/threonine-protein kinase PLK1
Ligand
BDBM41821
Substrate
Meas. Tech.
Concentration Response Redox Cycling H2O2 Generation assay, 1 mM DTT, to characterize small molecule inhibitors identified in the Polo box domain (PBD) of Plk1 Primary HTS.
EC50
>50000±n/a nM
Citation
 PubChem, PC Concentration Response Redox Cycling H2O2 Generation assay, 1 mM DTT, to characterize small molecule inhibitors identified in the Polo box domain (PBD) of Plk1 Primary HTS. PubChem Bioassay (2007)[AID] 
Target
Name:
Serine/threonine-protein kinase PLK1
Synonyms:
PLK PLK1 Polo-like kinase 1 (PlK1) STPK13 Serine/threonine-protein kinase 13 | polo-like kinase
Type:
Serine/threonine-protein kinase
Mol. Mass.:
68277.16
Organism:
Homo sapiens (Human)
Description:
P53350
Residue:
603
  
Inhibitor
Name:
BDBM41821
Synonyms:
2-[1-(anilinocarbonothioyl)-3-oxo-2-piperazinyl]-N-(2,3-dihydro-1,4-benzodioxin-6-yl)acetamide MLS000538345 N-(2,3-dihydro-1,4-benzodioxin-6-yl)-2-[3-oxidanylidene-1-(phenylcarbamothioyl)piperazin-2-yl]ethanamide SMR000144382 | cid_2968933
Type:
Small organic molecule
Emp. Form.:
C21H22N4O4S
Mol. Mass.:
426.489
SMILES:
O=C(CC1N(CCNC1=O)C(=S)Nc1ccccc1)Nc1ccc2OCCOc2c1
: