Target
Serine/threonine-protein kinase PLK1
Ligand
BDBM41839
Substrate
Meas. Tech.
Concentration Response Redox Cycling H2O2 Generation assay, 1 mM DTT, to characterize small molecule inhibitors identified in the Polo box domain (PBD) of Plk1 Primary HTS.
EC50
>50000±n/a nM
Citation
 PubChem, PC Concentration Response Redox Cycling H2O2 Generation assay, 1 mM DTT, to characterize small molecule inhibitors identified in the Polo box domain (PBD) of Plk1 Primary HTS. PubChem Bioassay (2007)[AID] 
Target
Name:
Serine/threonine-protein kinase PLK1
Synonyms:
PLK PLK1 Polo-like kinase 1 (PlK1) STPK13 Serine/threonine-protein kinase 13 | polo-like kinase
Type:
Serine/threonine-protein kinase
Mol. Mass.:
68277.16
Organism:
Homo sapiens (Human)
Description:
P53350
Residue:
603
  
Inhibitor
Name:
BDBM41839
Synonyms:
1-(3-chloro-1,4-diketo-2-naphthyl)isonipecotamide 1-(3-chloro-1,4-dioxo-2-naphthalenyl)-4-piperidinecarboxamide 1-[3-chloranyl-1,4-bis(oxidanylidene)naphthalen-2-yl]piperidine-4-carboxamide SMR000180199 | cid_1481943
Type:
Small organic molecule
Emp. Form.:
C16H15ClN2O3
Mol. Mass.:
318.755
SMILES:
NC(=O)C1CCN(CC1)C1=C(Cl)C(=O)c2ccccc2C1=O
: