Target
Serine/threonine-protein kinase PLK1
Ligand
BDBM41847
Substrate
Meas. Tech.
Concentration Response Redox Cycling H2O2 Generation assay, 1 mM DTT, to characterize small molecule inhibitors identified in the Polo box domain (PBD) of Plk1 Primary HTS.
EC50
>50000±n/a nM
Citation
 PubChem, PC Concentration Response Redox Cycling H2O2 Generation assay, 1 mM DTT, to characterize small molecule inhibitors identified in the Polo box domain (PBD) of Plk1 Primary HTS. PubChem Bioassay (2007)[AID] 
Target
Name:
Serine/threonine-protein kinase PLK1
Synonyms:
PLK PLK1 Polo-like kinase 1 (PlK1) STPK13 Serine/threonine-protein kinase 13 | polo-like kinase
Type:
Serine/threonine-protein kinase
Mol. Mass.:
68277.16
Organism:
Homo sapiens (Human)
Description:
P53350
Residue:
603
  
Inhibitor
Name:
BDBM41847
Synonyms:
MLS000575866 N-[(E)-1-(4-nitrophenyl)-3-oxidanylidene-3-(2-phenylethylamino)prop-1-en-2-yl]benzamide N-[(E)-2-(4-nitrophenyl)-1-(phenethylcarbamoyl)vinyl]benzamide cid_5735412
Type:
Small organic molecule
Emp. Form.:
C24H21N3O4
Mol. Mass.:
415.4412
SMILES:
[O-][N+](=O)c1ccc(\C=C(\NC(=O)c2ccccc2)C(=O)NCCc2ccccc2)cc1
: