Target
Diphosphomevalonate decarboxylase
Ligand
BDBM45768
Substrate
Meas. Tech.
Screening for Inhibitors of the Mevalonate Pathway in Streptococcus Pneumoniae - DPM-DC - Secondary Assay
IC50
2270±20400 nM
Citation
 PubChem, PC Screening for Inhibitors of the Mevalonate Pathway in Streptococcus Pneumoniae - DPM-DC - Secondary Assay PubChem Bioassay (2008)[AID] 
Target
Name:
Diphosphomevalonate decarboxylase
Synonyms:
Type:
Enzyme Catalytic Domain
Mol. Mass.:
35571.44
Organism:
Streptococcus pneumoniae D39
Description:
A0A0H2ZN59
Residue:
317
  
Inhibitor
Name:
BDBM45768
Synonyms:
AB00540129 N-cyclopropyl-3-(3-oxidanylidene-1,2-benzothiazol-2-yl)benzamide cid_16749992
Type:
Small organic molecule
Emp. Form.:
C17H14N2O2S
Mol. Mass.:
310.37
SMILES:
O=C(NC1CC1)c1cccc(c1)-n1sc2ccccc2c1=O
: