Target
Alkaline phosphatase, tissue-nonspecific isozyme
Ligand
BDBM50254373
Substrate
Meas. Tech.
SAR analysis of an In Vitro TNAP Dose Response Luminescent Assay
IC50
574±n/a nM
Citation
 PubChem, PC SAR analysis of an In Vitro TNAP Dose Response Luminescent Assay PubChem Bioassay (2010)[AID] 
Target
Name:
Alkaline phosphatase, tissue-nonspecific isozyme
Synonyms:
ALPL tissue-nonspecific alkaline phosphatase precursor
Type:
PROTEIN
Mol. Mass.:
57306.17
Organism:
Homo sapiens (Human)
Description:
ChEMBL_1448917
Residue:
524
  
Inhibitor
Name:
BDBM50254373
Synonyms:
(3-(2,4-dichlorophenyl)-1H-pyrazol-5-yl)(morpholino)methanone cid_24178133
Type:
Small organic molecule
Emp. Form.:
C14H13Cl2N3O2
Mol. Mass.:
326.178
SMILES:
Clc1ccc(-c2cc([nH]n2)C(=O)N2CCOCC2)c(Cl)c1
: