Target
Serine/threonine-protein kinase PLK1
Ligand
BDBM46114
Substrate
Meas. Tech.
Concentration Response fluorescence polarization-based assay to test PMLSC Chemistry Core synthesized analogs of confirmed hits from the Polo box domain (PBD) of Plk1 Primary HTS.
IC50
>50000±n/a nM
Citation
 PubChem, PC Concentration Response fluorescence polarization-based assay to test PMLSC Chemistry Core synthesized analogs of confirmed hits from the Polo box domain (PBD) of Plk1 Primary HTS. PubChem Bioassay (2008)[AID] 
Target
Name:
Serine/threonine-protein kinase PLK1
Synonyms:
PLK PLK1 Polo-like kinase 1 (PlK1) STPK13 Serine/threonine-protein kinase 13 | polo-like kinase
Type:
Serine/threonine-protein kinase
Mol. Mass.:
68277.16
Organism:
Homo sapiens (Human)
Description:
P53350
Residue:
603
  
Inhibitor
Name:
BDBM46114
Synonyms:
3-[(6-amino-2,4-diketo-1-methyl-pyrimidine-5-carbonyl)amino]benzoic acid ethyl ester UPDDI-00398617 ethyl 3-[(6-amino-1-methyl-2,4-dioxopyrimidine-5-carbonyl)amino]benzoate | ethyl 3-[[6-azanyl-1-methyl-2,4-bis(oxidanylidene)pyrimidin-5-yl]carbonylamino]benzoate
Type:
Small organic molecule
Emp. Form.:
C15H16N4O5
Mol. Mass.:
332.3113
SMILES:
CCOC(=O)c1cccc(NC(=O)c2c(N)n(C)c(=O)[nH]c2=O)c1
: