Target
Tyrosine-protein phosphatase non-receptor type 7
Ligand
BDBM46134
Substrate
Meas. Tech.
Fluorescent secondary assay for dose-response confirmation of chemical inhibitors of HePTP
IC50
>100000±n/a nM
Citation
 PubChem, PC Fluorescent secondary assay for dose-response confirmation of chemical inhibitors of HePTP PubChem Bioassay (2009)[AID] 
Target
Name:
Tyrosine-protein phosphatase non-receptor type 7
Synonyms:
He-PTP Hematopoietic protein-tyrosine phosphatase (HEPTP) PTPN7 Tyrosine-protein phosphatase non-receptor type 7 | Tyrosine-protein phosphatase non-receptor type 7 (HEPTP)
Type:
Protein
Mol. Mass.:
40530.79
Organism:
Homo sapiens (Human)
Description:
P35236
Residue:
360
  
Inhibitor
Name:
BDBM46134
Synonyms:
2-[(3-ethyl-4-keto-5,6,7,8-tetrahydrobenzothiopheno[2,3-d]pyrimidin-2-yl)thio]acetic acid 2-[(3-ethyl-4-oxo-5,6,7,8-tetrahydro-[1]benzothiolo[2,3-d]pyrimidin-2-yl)sulfanyl]acetic acid MLS-0091945.0001 | cid_742743
Type:
Small organic molecule
Emp. Form.:
C14H16N2O3S2
Mol. Mass.:
324.418
SMILES:
CCn1c(SCC(O)=O)nc2sc3CCCCc3c2c1=O
: