Target
Tyrosine-protein phosphatase non-receptor type 7
Ligand
BDBM46144
Substrate
Meas. Tech.
Fluorescent secondary assay for dose-response confirmation of chemical inhibitors of HePTP
IC50
73300±n/a nM
Citation
 PubChem, PC Fluorescent secondary assay for dose-response confirmation of chemical inhibitors of HePTP PubChem Bioassay (2009)[AID] 
Target
Name:
Tyrosine-protein phosphatase non-receptor type 7
Synonyms:
He-PTP Hematopoietic protein-tyrosine phosphatase (HEPTP) PTPN7 Tyrosine-protein phosphatase non-receptor type 7 | Tyrosine-protein phosphatase non-receptor type 7 (HEPTP)
Type:
Protein
Mol. Mass.:
40530.79
Organism:
Homo sapiens (Human)
Description:
P35236
Residue:
360
  
Inhibitor
Name:
BDBM46144
Synonyms:
12-hentriacontynoic acid cid_16654689 | hentriacont-12-ynoic acid
Type:
Small organic molecule
Emp. Form.:
C31H58O2
Mol. Mass.:
462.791
SMILES:
CCCCCCCCCCCCCCCCCCC#CCCCCCCCCCCC(O)=O
: