Target
Tyrosine-protein phosphatase non-receptor type 7
Ligand
BDBM34452
Substrate
Meas. Tech.
Fluorescent secondary assay for dose-response confirmation of chemical inhibitors of HePTP
IC50
2225±n/a nM
Citation
 PubChem, PC Fluorescent secondary assay for dose-response confirmation of chemical inhibitors of HePTP PubChem Bioassay (2009)[AID] 
Target
Name:
Tyrosine-protein phosphatase non-receptor type 7
Synonyms:
He-PTP Hematopoietic protein-tyrosine phosphatase (HEPTP) PTPN7 Tyrosine-protein phosphatase non-receptor type 7 | Tyrosine-protein phosphatase non-receptor type 7 (HEPTP)
Type:
Protein
Mol. Mass.:
40530.79
Organism:
Homo sapiens (Human)
Description:
P35236
Residue:
360
  
Inhibitor
Name:
BDBM34452
Synonyms:
(4-amino-3-phenyl-2-sulfanylidene-1,3-thiazol-5-yl)-(4-methylpiperazin-1-yl)methanone (4-amino-3-phenyl-2-thioxo-4-thiazolin-5-yl)-(4-methylpiperazino)methanone 4-amino-5-[(4-methyl-1-piperazinyl)carbonyl]-3-phenyl-1,3-thiazole-2(3H)-thione SMR000072313 | cid_889170
Type:
Small organic molecule
Emp. Form.:
C15H18N4OS2
Mol. Mass.:
334.46
SMILES:
CN1CCN(CC1)C(=O)c1sc(=S)n(c1N)-c1ccccc1
: