Target
Tyrosine-protein phosphatase non-receptor type 7
Ligand
BDBM34408
Substrate
Meas. Tech.
Fluorescent secondary assay for dose-response confirmation of chemical inhibitors of HePTP
IC50
1129±n/a nM
Citation
 PubChem, PC Fluorescent secondary assay for dose-response confirmation of chemical inhibitors of HePTP PubChem Bioassay (2009)[AID] 
Target
Name:
Tyrosine-protein phosphatase non-receptor type 7
Synonyms:
He-PTP Hematopoietic protein-tyrosine phosphatase (HEPTP) PTPN7 Tyrosine-protein phosphatase non-receptor type 7 | Tyrosine-protein phosphatase non-receptor type 7 (HEPTP)
Type:
Protein
Mol. Mass.:
40530.79
Organism:
Homo sapiens (Human)
Description:
P35236
Residue:
360
  
Inhibitor
Name:
BDBM34408
Synonyms:
4-amino-3-(4-methylphenyl)-5-[(4-methyl-1-piperazinyl)carbonyl]-1,3-thiazole-2(3H)-thione SMR000072496 [4-amino-3-(4-methylphenyl)-2-sulfanylidene-5-thiazolyl]-(4-methyl-1-piperazinyl)methanone [4-azanyl-3-(4-methylphenyl)-2-sulfanylidene-1,3-thiazol-5-yl]-(4-methylpiperazin-1-yl)methanone | cid_889983
Type:
Small organic molecule
Emp. Form.:
C16H20N4OS2
Mol. Mass.:
348.486
SMILES:
CN1CCN(CC1)C(=O)c1sc(=S)n(c1N)-c1ccc(C)cc1
: