Target
Tyrosine-protein phosphatase non-receptor type 7
Ligand
BDBM46225
Substrate
Meas. Tech.
Fluorescent secondary assay for dose-response confirmation of chemical inhibitors of HePTP
IC50
321±n/a nM
Citation
 PubChem, PC Fluorescent secondary assay for dose-response confirmation of chemical inhibitors of HePTP PubChem Bioassay (2009)[AID] 
Target
Name:
Tyrosine-protein phosphatase non-receptor type 7
Synonyms:
He-PTP Hematopoietic protein-tyrosine phosphatase (HEPTP) PTPN7 Tyrosine-protein phosphatase non-receptor type 7 | Tyrosine-protein phosphatase non-receptor type 7 (HEPTP)
Type:
Protein
Mol. Mass.:
40530.79
Organism:
Homo sapiens (Human)
Description:
P35236
Residue:
360
  
Inhibitor
Name:
BDBM46225
Synonyms:
MLS-0266851.0001 | cid_2545467
Type:
Small organic molecule
Emp. Form.:
C23H18N2O7S2
Mol. Mass.:
498.528
SMILES:
CCOC(=O)c1sc2nc3c(SCC(O)=O)cc(cn3c(=O)c2c1C)C(=O)c1ccccc1O
: