Target
Estrogen receptor beta
Ligand
BDBM46289
Substrate
Meas. Tech.
Estrogen Receptor (beta) binding: Dose Response of Primary Screen Assay
EC50
438.4±n/a nM
Citation
 PubChem, PC Estrogen Receptor (beta) binding: Dose Response of Primary Screen Assay PubChem Bioassay (2008)[AID] 
Target
Name:
Estrogen receptor beta
Synonyms:
ER-beta ESR2_HUMAN Estradiol receptor beta (ERβ) Estrogen receptor (ER beta) Estrogen receptor beta (ER beta) NR3A2 estrogen beta
Type:
Protein
Mol. Mass.:
59238.43
Organism:
Homo sapiens (Human)
Description:
Q92731
Residue:
530
  
Inhibitor
Name:
BDBM46289
Synonyms:
2-methyl-7-oxidanyl-3-phenoxy-chromen-4-one 7-hydroxy-2-methyl-3-phenoxy-chromone MLS000104599 cid_5310638
Type:
Small organic molecule
Emp. Form.:
C16H12O4
Mol. Mass.:
268.2641
SMILES:
Cc1oc2cc(O)ccc2c(=O)c1Oc1ccccc1
: