Target
Nuclear receptor coactivator 2
Ligand
BDBM42887
Substrate
Meas. Tech.
Dose response biochemical High Throughput Screening assay for agonists of the steroid receptor coactivator 2 (SRC-2) recruitment by the peroxisome proliferator-activated receptor gamma (PPARgamma)
EC50
42510±n/a nM
Citation
 PubChem, PC Dose response biochemical High Throughput Screening assay for agonists of the steroid receptor coactivator 2 (SRC-2) recruitment by the peroxisome proliferator-activated receptor gamma (PPARgamma) PubChem Bioassay (2008)[AID] 
Target
Name:
Nuclear receptor coactivator 2
Synonyms:
BHLHE75 NCOA2 protein SRC2 | TIF2
Type:
Enzyme Catalytic Domain
Mol. Mass.:
159156.93
Organism:
Homo sapiens (Human)
Description:
Q15596
Residue:
1464
  
Inhibitor
Name:
BDBM42887
Synonyms:
5-Acetyl-2-(2-{5-[(4-fluoro-phenylamino)-methyl]-[1,3,4]oxadiazol-2-ylsulfanyl}-acetylamino)-4-methyl-thiophene-3-carboxylic acid ethyl ester 5-acetyl-2-[[2-[[5-[(4-fluoroanilino)methyl]-1,3,4-oxadiazol-2-yl]thio]acetyl]amino]-4-methyl-thiophene-3-carboxylic acid ethyl ester SMR000001674 ethyl 5-acetyl-2-[[2-[[5-[(4-fluoroanilino)methyl]-1,3,4-oxadiazol-2-yl]sulfanyl]acetyl]amino]-4-methylthiophene-3-carboxylate | ethyl 5-ethanoyl-2-[2-[[5-[[(4-fluorophenyl)amino]methyl]-1,3,4-oxadiazol-2-yl]sulfanyl]ethanoylamino]-4-methyl-thiophene-3-carboxylate
Type:
Small organic molecule
Emp. Form.:
C21H21FN4O5S2
Mol. Mass.:
492.544
SMILES:
CCOC(=O)c1c(C)c(sc1NC(=O)CSc1nnc(CNc2ccc(F)cc2)o1)C(C)=O
: