Target
Nuclear receptor coactivator 2
Ligand
BDBM42897
Substrate
Meas. Tech.
Dose response biochemical High Throughput Screening assay for agonists of the steroid receptor coactivator 2 (SRC-2) recruitment by the peroxisome proliferator-activated receptor gamma (PPARgamma)
EC50
>79370±n/a nM
Citation
 PubChem, PC Dose response biochemical High Throughput Screening assay for agonists of the steroid receptor coactivator 2 (SRC-2) recruitment by the peroxisome proliferator-activated receptor gamma (PPARgamma) PubChem Bioassay (2008)[AID] 
Target
Name:
Nuclear receptor coactivator 2
Synonyms:
BHLHE75 NCOA2 protein SRC2 | TIF2
Type:
Enzyme Catalytic Domain
Mol. Mass.:
159156.93
Organism:
Homo sapiens (Human)
Description:
Q15596
Residue:
1464
  
Inhibitor
Name:
BDBM42897
Synonyms:
2-(1,3-dimethyl-2,6-dioxo-7-propan-2-ylpurin-8-yl)sulfanyl-N-(furan-2-ylmethyl)acetamide 2-[1,3-dimethyl-2,6-bis(oxidanylidene)-7-propan-2-yl-purin-8-yl]sulfanyl-N-(furan-2-ylmethyl)ethanamide N-(2-furfuryl)-2-[(7-isopropyl-2,6-diketo-1,3-dimethyl-purin-8-yl)thio]acetamide SMR000003559 | cid_656060
Type:
Small organic molecule
Emp. Form.:
C17H21N5O4S
Mol. Mass.:
391.445
SMILES:
CC(C)n1c(SCC(=O)NCc2ccco2)nc2n(C)c(=O)n(C)c(=O)c12
: