Target
Nuclear receptor coactivator 2
Ligand
BDBM42918
Substrate
Meas. Tech.
Dose response biochemical High Throughput Screening assay for agonists of the steroid receptor coactivator 2 (SRC-2) recruitment by the peroxisome proliferator-activated receptor gamma (PPARgamma)
EC50
>79370±n/a nM
Citation
 PubChem, PC Dose response biochemical High Throughput Screening assay for agonists of the steroid receptor coactivator 2 (SRC-2) recruitment by the peroxisome proliferator-activated receptor gamma (PPARgamma) PubChem Bioassay (2008)[AID] 
Target
Name:
Nuclear receptor coactivator 2
Synonyms:
BHLHE75 NCOA2 protein SRC2 | TIF2
Type:
Enzyme Catalytic Domain
Mol. Mass.:
159156.93
Organism:
Homo sapiens (Human)
Description:
Q15596
Residue:
1464
  
Inhibitor
Name:
BDBM42918
Synonyms:
5-[2-[2-(cyclohexanecarbonylamino)acetyl]oxyacetyl]-2,4-dimethyl-1H-pyrrole-3-carboxylic acid ethyl ester MLS000036036 cid_2997869 ethyl 5-[2-[2-(cyclohexylcarbonylamino)ethanoyloxy]ethanoyl]-2,4-dimethyl-1H-pyrrole-3-carboxylate
Type:
Small organic molecule
Emp. Form.:
C20H28N2O6
Mol. Mass.:
392.4461
SMILES:
CCOC(=O)c1c(C)[nH]c(C(=O)COC(=O)CNC(=O)C2CCCCC2)c1C
: