Target
Nuclear receptor coactivator 2
Ligand
BDBM42920
Substrate
Meas. Tech.
Dose response biochemical High Throughput Screening assay for agonists of the steroid receptor coactivator 2 (SRC-2) recruitment by the peroxisome proliferator-activated receptor gamma (PPARgamma)
EC50
>79370±n/a nM
Citation
 PubChem, PC Dose response biochemical High Throughput Screening assay for agonists of the steroid receptor coactivator 2 (SRC-2) recruitment by the peroxisome proliferator-activated receptor gamma (PPARgamma) PubChem Bioassay (2008)[AID] 
Target
Name:
Nuclear receptor coactivator 2
Synonyms:
BHLHE75 NCOA2 protein SRC2 | TIF2
Type:
Enzyme Catalytic Domain
Mol. Mass.:
159156.93
Organism:
Homo sapiens (Human)
Description:
Q15596
Residue:
1464
  
Inhibitor
Name:
BDBM42920
Synonyms:
4-[1-(4-chlorophenyl)sulfonyl-2-pyrrolidinyl]-2-thiazolamine MLS000056128 [4-[1-(4-chlorophenyl)sulfonylpyrrolidin-2-yl]thiazol-2-yl]amine | cid_2998200
Type:
Small organic molecule
Emp. Form.:
C13H14ClN3O2S2
Mol. Mass.:
343.852
SMILES:
Nc1nc(cs1)C1CCCN1S(=O)(=O)c1ccc(Cl)cc1
: