Target
Nuclear receptor coactivator 2
Ligand
BDBM42958
Substrate
Meas. Tech.
Dose response biochemical High Throughput Screening assay for agonists of the steroid receptor coactivator 2 (SRC-2) recruitment by the peroxisome proliferator-activated receptor gamma (PPARgamma)
EC50
>79370±n/a nM
Citation
 PubChem, PC Dose response biochemical High Throughput Screening assay for agonists of the steroid receptor coactivator 2 (SRC-2) recruitment by the peroxisome proliferator-activated receptor gamma (PPARgamma) PubChem Bioassay (2008)[AID] 
Target
Name:
Nuclear receptor coactivator 2
Synonyms:
BHLHE75 NCOA2 protein SRC2 | TIF2
Type:
Enzyme Catalytic Domain
Mol. Mass.:
159156.93
Organism:
Homo sapiens (Human)
Description:
Q15596
Residue:
1464
  
Inhibitor
Name:
BDBM42958
Synonyms:
2-methoxy-N-(2-pyridinyl)benzamide 2-methoxy-N-2-pyridinylbenzamide 2-methoxy-N-pyridin-2-ylbenzamide SMR000069399 | cid_689500
Type:
Small organic molecule
Emp. Form.:
C13H12N2O2
Mol. Mass.:
228.2466
SMILES:
COc1ccccc1C(=O)Nc1ccccn1
: