Target
Nuclear receptor coactivator 2
Ligand
BDBM42960
Substrate
Meas. Tech.
Dose response biochemical High Throughput Screening assay for agonists of the steroid receptor coactivator 2 (SRC-2) recruitment by the peroxisome proliferator-activated receptor gamma (PPARgamma)
EC50
>79370±n/a nM
Citation
 PubChem, PC Dose response biochemical High Throughput Screening assay for agonists of the steroid receptor coactivator 2 (SRC-2) recruitment by the peroxisome proliferator-activated receptor gamma (PPARgamma) PubChem Bioassay (2008)[AID] 
Target
Name:
Nuclear receptor coactivator 2
Synonyms:
BHLHE75 NCOA2 protein SRC2 | TIF2
Type:
Enzyme Catalytic Domain
Mol. Mass.:
159156.93
Organism:
Homo sapiens (Human)
Description:
Q15596
Residue:
1464
  
Inhibitor
Name:
BDBM42960
Synonyms:
7-chloro-8-methyl-4-(4-morpholinyl)-3-quinolinecarboxylic acid ethyl ester;hydrochloride MLS000120368 cid_2789457 ethyl 7-chloro-8-methyl-4-morpholin-4-ylquinoline-3-carboxylate;hydrochloride
Type:
Small organic molecule
Emp. Form.:
C17H19ClN2O3
Mol. Mass.:
334.797
SMILES:
CCOC(=O)c1cnc2c(C)c(Cl)ccc2c1N1CCOCC1
: