Target
Nuclear receptor coactivator 2
Ligand
BDBM43169
Substrate
Meas. Tech.
Dose response biochemical High Throughput Screening assay for agonists of the steroid receptor coactivator 2 (SRC-2) recruitment by the peroxisome proliferator-activated receptor gamma (PPARgamma)
EC50
16220±n/a nM
Citation
 PubChem, PC Dose response biochemical High Throughput Screening assay for agonists of the steroid receptor coactivator 2 (SRC-2) recruitment by the peroxisome proliferator-activated receptor gamma (PPARgamma) PubChem Bioassay (2008)[AID] 
Target
Name:
Nuclear receptor coactivator 2
Synonyms:
BHLHE75 NCOA2 protein SRC2 | TIF2
Type:
Enzyme Catalytic Domain
Mol. Mass.:
159156.93
Organism:
Homo sapiens (Human)
Description:
Q15596
Residue:
1464
  
Inhibitor
Name:
BDBM43169
Synonyms:
2-(4-isopropoxybenzoyl)imino-3,4-dimethyl-4-thiazoline-5-carboxylic acid ethyl ester MLS000703542 cid_3341993 ethyl 3,4-dimethyl-2-(4-propan-2-yloxyphenyl)carbonylimino-1,3-thiazole-5-carboxylate
Type:
Small organic molecule
Emp. Form.:
C18H22N2O4S
Mol. Mass.:
362.443
SMILES:
CCOC(=O)c1s\c(=N\C(=O)c2ccc(OC(C)C)cc2)n(C)c1C
: