Target
Glutathione S-transferase Mu 1
Ligand
BDBM46296
Substrate
Meas. Tech.
Profiling Assay to determine GST-GSH interactions in multiplex bead-based assays (HPSMTB buffer)
EC50
26970±n/a nM
Citation
 PubChem, PC Profiling Assay to determine GST-GSH interactions in multiplex bead-based assays (HPSMTB buffer) PubChem Bioassay (2008)[AID] 
Target
Name:
Glutathione S-transferase Mu 1
Synonyms:
GST class-mu 1 GSTM1 GSTM1_HUMAN GSTM1b-1b Glutathione S-transferase Mu 1 glutathione S-transferase
Type:
PROTEIN
Mol. Mass.:
25712.03
Organism:
Homo sapiens (Human)
Description:
ChEMBL_799596
Residue:
218
  
Inhibitor
Name:
BDBM46296
Synonyms:
(2-methoxyphenyl)-[4-(2-methylimidazo[1,2-a]pyrimidin-3-yl)thiazol-2-yl]amine;hydrobromide N-(2-methoxyphenyl)-4-(2-methyl-3-imidazo[1,2-a]pyrimidinyl)-2-thiazolamine;hydrobromide SMR000288807 | cid_2877735
Type:
Small organic molecule
Emp. Form.:
C17H15N5OS
Mol. Mass.:
337.399
SMILES:
COc1ccccc1Nc1nc(cs1)-c1c(C)nc2ncccn12
: