Target
Bcl-2-like protein 10 [11-204]
Ligand
BDBM32291
Substrate
Meas. Tech.
Multiplexed high-throughput screen for small molecule regulators of Bcl-2 family protein interactions, specifically Bim-Bcl-B protein.
EC50
20050±n/a nM
Citation
 PubChem, PC Multiplexed high-throughput screen for small molecule regulators of Bcl-2 family protein interactions, specifically Bim-Bcl-B protein. PubChem Bioassay (2008)[AID] 
Target
Name:
Bcl-2-like protein 10 [11-204]
Synonyms:
Apoptosis regulator Bcl-B (Bcl-2-like 10 protein) (Bcl2-L-10) (Anti-apoptotic protein NrH). BCL-B BCLB DIVA
Type:
Enzyme Catalytic Domain
Mol. Mass.:
21981.77
Organism:
Homo sapiens (Human)
Description:
gi_23396469
Residue:
194
  
Inhibitor
Name:
BDBM32291
Synonyms:
(1,1-diketo-1,2-benzothiazol-3-yl)-methyl-(3-pyridylmethyleneamino)amine N-methyl-1,1-bis(oxidanylidene)-N-(pyridin-3-ylmethylideneamino)-1,2-benzothiazol-3-amine N-methyl-1,1-dioxo-N-(pyridin-3-ylmethylideneamino)-1,2-benzothiazol-3-amine cid_702559 | nicotinaldehyde (1,1-dioxido-1,2-benzisothiazol-3-yl)(methyl)hydrazone
Type:
Small organic molecule
Emp. Form.:
C14H12N4O2S
Mol. Mass.:
300.336
SMILES:
CN(N=Cc1cccnc1)C1=NS(=O)(=O)c2ccccc12
: