Target
Bcl-2-like protein 10 [11-204]
Ligand
BDBM32324
Substrate
Meas. Tech.
Multiplexed high-throughput screen for small molecule regulators of Bcl-2 family protein interactions, specifically Bim-Bcl-B protein.
EC50
15570±n/a nM
Citation
 PubChem, PC Multiplexed high-throughput screen for small molecule regulators of Bcl-2 family protein interactions, specifically Bim-Bcl-B protein. PubChem Bioassay (2008)[AID] 
Target
Name:
Bcl-2-like protein 10 [11-204]
Synonyms:
Apoptosis regulator Bcl-B (Bcl-2-like 10 protein) (Bcl2-L-10) (Anti-apoptotic protein NrH). BCL-B BCLB DIVA
Type:
Enzyme Catalytic Domain
Mol. Mass.:
21981.77
Organism:
Homo sapiens (Human)
Description:
gi_23396469
Residue:
194
  
Inhibitor
Name:
BDBM32324
Synonyms:
6-(2-methoxy-5-methyl-phenyl)benzo[d][2]benzazepine-5,7-dione 6-(2-methoxy-5-methylphenyl)benzo[d][2]benzazepine-5,7-dione SMR000323067 | cid_756005
Type:
Small organic molecule
Emp. Form.:
C22H17NO3
Mol. Mass.:
343.3753
SMILES:
COc1ccc(C)cc1-n1c(=O)c2ccccc2c2ccccc2c1=O
: