Target
Bcl-2-like protein 2
Ligand
BDBM32323
Substrate
Meas. Tech.
Multiplexed dose response screen for small molecule regulators of Bcl-2 family protein interactions, specifically Bim-Bcl-W.
EC50
7890±n/a nM
Citation
 PubChem, PC Multiplexed dose response screen for small molecule regulators of Bcl-2 family protein interactions, specifically Bim-Bcl-W. PubChem Bioassay (2008)[AID] 
Target
Name:
Bcl-2-like protein 2
Synonyms:
Apoptosis regulator Bcl-W BCL-W BCLW Bcl2-L-2 | KIAA0271
Type:
Protein
Mol. Mass.:
20742.61
Organism:
Homo sapiens (Human)
Description:
Residue:
193
  
Inhibitor
Name:
BDBM32323
Synonyms:
MLS000685782 N-[3-(3-methyl-[1,2,4]triazolo[4,3-b]pyridazin-6-yl)phenyl]-2-furancarboxamide SMR000324305 | cid_7532476
Type:
Small organic molecule
Emp. Form.:
C17H13N5O2
Mol. Mass.:
319.3174
SMILES:
Cc1nnc2ccc(nn12)-c1cccc(NC(=O)c2ccco2)c1
: