Target
Nuclear receptor coactivator 3
Ligand
BDBM42923
Substrate
Meas. Tech.
Dose response biochemical High Throughput Screening assay for agonists of the steroid receptor coactivator 3 (SRC-3) recruitment by the peroxisome proliferator-activated receptor gamma (PPARgamma)
EC50
21760±n/a nM
Citation
 PubChem, PC Dose response biochemical High Throughput Screening assay for agonists of the steroid receptor coactivator 3 (SRC-3) recruitment by the peroxisome proliferator-activated receptor gamma (PPARgamma) PubChem Bioassay (2008)[AID] 
Target
Name:
Nuclear receptor coactivator 3
Synonyms:
AIB1 NCOA3 RAC3 nuclear receptor coactivator 3 isoform a
Type:
Enzyme Catalytic Domain
Mol. Mass.:
155305.29
Organism:
Homo sapiens (Human)
Description:
Q9Y6Q9
Residue:
1424
  
Inhibitor
Name:
BDBM42923
Synonyms:
2-(1,3-benzoxazol-2-ylsulfanyl)-1-(3,4,5-trimethoxyphenyl)ethanone MLS000082210 cid_2365424
Type:
Small organic molecule
Emp. Form.:
C18H17NO5S
Mol. Mass.:
359.396
SMILES:
COc1cc(cc(OC)c1OC)C(=O)CSc1nc2ccccc2o1
: