Target
Nuclear receptor coactivator 3
Ligand
BDBM42931
Substrate
Meas. Tech.
Dose response biochemical High Throughput Screening assay for agonists of the steroid receptor coactivator 3 (SRC-3) recruitment by the peroxisome proliferator-activated receptor gamma (PPARgamma)
EC50
22930±n/a nM
Citation
 PubChem, PC Dose response biochemical High Throughput Screening assay for agonists of the steroid receptor coactivator 3 (SRC-3) recruitment by the peroxisome proliferator-activated receptor gamma (PPARgamma) PubChem Bioassay (2008)[AID] 
Target
Name:
Nuclear receptor coactivator 3
Synonyms:
AIB1 NCOA3 RAC3 nuclear receptor coactivator 3 isoform a
Type:
Enzyme Catalytic Domain
Mol. Mass.:
155305.29
Organism:
Homo sapiens (Human)
Description:
Q9Y6Q9
Residue:
1424
  
Inhibitor
Name:
BDBM42931
Synonyms:
2-[4-(1,3-benzothiazol-2-yl)-1-piperazinyl]-4-methoxy-1,3-benzothiazole 2-[4-(1,3-benzothiazol-2-yl)piperazino]-4-methoxy-1,3-benzothiazole SMR000027238 | cid_3240147
Type:
Small organic molecule
Emp. Form.:
C19H18N4OS2
Mol. Mass.:
382.502
SMILES:
COc1cccc2sc(nc12)N1CCN(CC1)c1nc2ccccc2s1
: