Target
Nuclear receptor coactivator 3
Ligand
BDBM42946
Substrate
Meas. Tech.
Dose response biochemical High Throughput Screening assay for agonists of the steroid receptor coactivator 3 (SRC-3) recruitment by the peroxisome proliferator-activated receptor gamma (PPARgamma)
EC50
>79370±n/a nM
Citation
 PubChem, PC Dose response biochemical High Throughput Screening assay for agonists of the steroid receptor coactivator 3 (SRC-3) recruitment by the peroxisome proliferator-activated receptor gamma (PPARgamma) PubChem Bioassay (2008)[AID] 
Target
Name:
Nuclear receptor coactivator 3
Synonyms:
AIB1 NCOA3 RAC3 nuclear receptor coactivator 3 isoform a
Type:
Enzyme Catalytic Domain
Mol. Mass.:
155305.29
Organism:
Homo sapiens (Human)
Description:
Q9Y6Q9
Residue:
1424
  
Inhibitor
Name:
BDBM42946
Synonyms:
(6-morpholino-1,3-benzothiazol-2-yl)amine 6-morpholin-4-yl-1,3-benzothiazol-2-amine SMR000075944 | cid_937197
Type:
Small organic molecule
Emp. Form.:
C11H13N3OS
Mol. Mass.:
235.305
SMILES:
Nc1nc2ccc(cc2s1)N1CCOCC1
: