Target
Nuclear receptor coactivator 3
Ligand
BDBM43176
Substrate
Meas. Tech.
Dose response biochemical High Throughput Screening assay for agonists of the steroid receptor coactivator 3 (SRC-3) recruitment by the peroxisome proliferator-activated receptor gamma (PPARgamma)
EC50
22960±n/a nM
Citation
 PubChem, PC Dose response biochemical High Throughput Screening assay for agonists of the steroid receptor coactivator 3 (SRC-3) recruitment by the peroxisome proliferator-activated receptor gamma (PPARgamma) PubChem Bioassay (2008)[AID] 
Target
Name:
Nuclear receptor coactivator 3
Synonyms:
AIB1 NCOA3 RAC3 nuclear receptor coactivator 3 isoform a
Type:
Enzyme Catalytic Domain
Mol. Mass.:
155305.29
Organism:
Homo sapiens (Human)
Description:
Q9Y6Q9
Residue:
1424
  
Inhibitor
Name:
BDBM43176
Synonyms:
4-fluoranyl-N-(2-phenylquinazolin-4-yl)benzamide 4-fluoro-N-(2-phenyl-4-quinazolinyl)benzenecarboxamide MLS000755733 cid_4616002
Type:
Small organic molecule
Emp. Form.:
C21H14FN3O
Mol. Mass.:
343.3538
SMILES:
Fc1ccc(cc1)C(=O)Nc1nc(nc2ccccc12)-c1ccccc1
: