Target
Serine/threonine-protein kinase D1
Ligand
BDBM32358
Substrate
Meas. Tech.
Fluorescence polarization assay for PKD inhibitiors-interference assay-57K HTS campaign
IC50
>50000±n/a nM
Citation
 PubChem, PC Fluorescence polarization assay for PKD inhibitiors-interference assay-57K HTS campaign PubChem Bioassay (2008)[AID] 
Target
Name:
Serine/threonine-protein kinase D1
Synonyms:
KPCD1_HUMAN PKD1 PRKD1 Protein kinase C mu type Protein kinase C, PKC; classical/novel Protein kinase D (PRKD1) nPKC-D1 | nPKC-mu
Type:
Serine/threonine-protein kinase
Mol. Mass.:
101705.07
Organism:
Homo sapiens (Human)
Description:
gi_115529463
Residue:
912
  
Inhibitor
Name:
BDBM32358
Synonyms:
2-chloro-5-(1-piperidinylsulfonyl)benzoic acid [2-[[(1-methyl-2-pyrrolyl)-oxomethyl]amino]-2-oxoethyl] ester MLS001002843 [2-[(1-methylpyrrol-2-yl)carbonylamino]-2-oxidanylidene-ethyl] 2-chloranyl-5-piperidin-1-ylsulfonyl-benzoate cid_2438071
Type:
Small organic molecule
Emp. Form.:
C20H22ClN3O6S
Mol. Mass.:
467.923
SMILES:
Cn1cccc1C(=O)NC(=O)COC(=O)c1cc(ccc1Cl)S(=O)(=O)N1CCCCC1
: