Target
Signal transducer and activator of transcription 3 [702-738,740-752]
Ligand
BDBM35354
Substrate
Meas. Tech.
Dose response cell-based assay to measure STAT3 inhibition
IC50
3279±n/a nM
Citation
 PubChem, PC Dose response cell-based assay to measure STAT3 inhibition PubChem Bioassay (2008)[AID] 
Target
Name:
Signal transducer and activator of transcription 3 [702-738,740-752]
Synonyms:
APRF STAT3_HUMAN
Type:
Enzyme Catalytic Domain
Mol. Mass.:
5263.93
Organism:
Homo sapiens (Human)
Description:
gi_13272532
Residue:
50
  
Inhibitor
Name:
BDBM35354
Synonyms:
4-N-(2-methylcyclohexyl)-1-N-(pyridin-4-ylmethyl)benzene-1,4-disulfonamide MLS000032786 N4-(2-methylcyclohexyl)-N1-(pyridin-4-ylmethyl)benzene-1,4-disulfonamide cid_645986
Type:
Small organic molecule
Emp. Form.:
C19H25N3O4S2
Mol. Mass.:
423.549
SMILES:
CC1CCCCC1NS(=O)(=O)c1ccc(cc1)S(=O)(=O)NCc1ccncc1
: