Target
Signal transducer and activator of transcription 3 [702-738,740-752]
Ligand
BDBM46380
Substrate
Meas. Tech.
Dose response cell-based assay to measure STAT3 inhibition
IC50
7928±n/a nM
Citation
 PubChem, PC Dose response cell-based assay to measure STAT3 inhibition PubChem Bioassay (2008)[AID] 
Target
Name:
Signal transducer and activator of transcription 3 [702-738,740-752]
Synonyms:
APRF STAT3_HUMAN
Type:
Enzyme Catalytic Domain
Mol. Mass.:
5263.93
Organism:
Homo sapiens (Human)
Description:
gi_13272532
Residue:
50
  
Inhibitor
Name:
BDBM46380
Synonyms:
2-(1,3-dioxooctahydro-2H-isoindol-2-yl)phenyl benzoate SMR000164170 [2-[1,3-bis(oxidanylidene)-3a,4,5,6,7,7a-hexahydroisoindol-2-yl]phenyl] benzoate benzoic acid [2-(1,3-dioxo-3a,4,5,6,7,7a-hexahydroisoindol-2-yl)phenyl] ester | cid_4694793
Type:
Small organic molecule
Emp. Form.:
C21H19NO4
Mol. Mass.:
349.3799
SMILES:
Oc1c2CCCCc2c(O)n1-c1ccccc1OC(=O)c1ccccc1
: