Target
Signal transducer and activator of transcription 3 [702-738,740-752]
Ligand
BDBM46413
Substrate
Meas. Tech.
Dose response cell-based assay to measure STAT3 inhibition
IC50
4050±n/a nM
Citation
 PubChem, PC Dose response cell-based assay to measure STAT3 inhibition PubChem Bioassay (2008)[AID] 
Target
Name:
Signal transducer and activator of transcription 3 [702-738,740-752]
Synonyms:
APRF STAT3_HUMAN
Type:
Enzyme Catalytic Domain
Mol. Mass.:
5263.93
Organism:
Homo sapiens (Human)
Description:
gi_13272532
Residue:
50
  
Inhibitor
Name:
BDBM46413
Synonyms:
2-benzyl-5-(4-bromophenyl)pyrazol-3-amine 5-(4-bromophenyl)-2-(phenylmethyl)pyrazol-3-amine SMR000282133 cid_693933
Type:
Small organic molecule
Emp. Form.:
C16H14BrN3
Mol. Mass.:
328.206
SMILES:
Nc1cc(nn1Cc1ccccc1)-c1ccc(Br)cc1
: