Target
Gag-Pol polyprotein [600-1027,Y780C]/[600-1155,Y780C]
Ligand
BDBM2022
Substrate
poly(rC)500:oligo(dG)10
Meas. Tech.
HIV-1 RT Assay
pH
7.8±n/a
Temperature
295.15±n/a K
IC50
150±n/a nM
Citation
 Cywin, CLKlunder, JMHoermann, MBrickwood, JRDavid, EGrob, PMSchwartz, RPauletti, DBarringer, KJShih, CKSorge, CLErickson, DAJoseph, DPHattox, SE Novel Nonnucleoside Inhibitors of HIV-1 Reverse Transcriptase. 8. 8-Aryloxymethyl- and 8-Arylthiomethyldipyridodiazepinones J Med Chem 41:2972-84 (1998)  
Target
Name:
Gag-Pol polyprotein [600-1027,Y780C]/[600-1155,Y780C]
Synonyms:
EC: 2.7.7.49 | HIV-1 Reverse Transcriptase Mutant (Y181C)
Type:
Protein Complex
Mol. Mass.:
115564
Description:
Components:
This complex has 2 components.
Component 1
Name:
Gag-Pol polyprotein [600-1155,Y780C]
Synonyms:
HIV-1 Reverse Transcriptase Mutant (Y181C) Chain A gag-pol
Type:
Enzyme Subunit
Mol. Mass.:
63868.77
Organism:
Human immunodeficiency virus type 1
Description:
P03366[600-1155,Y780C]
Residue:
556
  
Component 2
Name:
Gag-Pol polyprotein [600-1027,Y780C]
Synonyms:
HIV-1 Reverse Transcriptase Mutant (Y181C) Chain B gag-pol
Type:
Enzyme Subunit
Mol. Mass.:
49908.60
Organism:
Human immunodeficiency virus type 1
Description:
P03366[600-1027,Y780C]
Residue:
428
  
Inhibitor
Name:
BDBM2022
Synonyms:
2,8-Disubstituted Dipyridodiazepinone 36 2,8-disubstituted dipyridodiazepinone III | 5-chloro-2-ethyl-9-methyl-13-(2-phenylethyl)-2,4,9,15-tetraazatricyclo[9.4.0.0^{3,8}]pentadeca-1(11),3,5,7,12,14-hexaen-10-one
Type:
Small organic molecule
Emp. Form.:
C22H21ClN4O
Mol. Mass.:
392.881
SMILES:
CCN1c2nc(Cl)ccc2N(C)C(=O)c2cc(CCc3ccccc3)cnc12
:
Substrate
Name:
poly(rC)500:oligo(dG)10
Synonyms:
Type:
RNA\DNA duplex
Mol. Mass.:
358.43
Organism:
Description:
The incorporation of Tritium-labeled dGTP onto a (poly)rC:(oligo)dG template:primer.
Residue:
3
NA