Target
Signal transducer and activator of transcription 1-alpha/beta
Ligand
BDBM46343
Substrate
Meas. Tech.
Dose response counterscreen assay for STAT3 inhibitors: cell-based high throughput assay to measure STAT1 inhibition
IC50
>55700±n/a nM
Citation
 PubChem, PC Dose response counterscreen assay for STAT3 inhibitors: cell-based high throughput assay to measure STAT1 inhibition PubChem Bioassay (2008)[AID] 
Target
Name:
Signal transducer and activator of transcription 1-alpha/beta
Synonyms:
STAT1 Signal transducer and activator of transcription 1-alpha/beta Transcription factor ISGF-3 components p91/p84 | signal transducer and activator of transcription 1 isoform alpha
Type:
Cytosolic Transcription Factor
Mol. Mass.:
87327.69
Organism:
Homo sapiens (Human)
Description:
Stat1 was expressed in sf9 cells from a baculovirus encoding the recombinant proteins. Stat1 dimer binds to DNA.
Residue:
750
  
Inhibitor
Name:
BDBM46343
Synonyms:
4-(4-morpholinylsulfonyl)-N-[4-(pyridin-4-ylmethyl)phenyl]benzamide 4-morpholin-4-ylsulfonyl-N-[4-(pyridin-4-ylmethyl)phenyl]benzamide MLS000043991 cid_1267735
Type:
Small organic molecule
Emp. Form.:
C23H23N3O4S
Mol. Mass.:
437.511
SMILES:
O=C(Nc1ccc(Cc2ccncc2)cc1)c1ccc(cc1)S(=O)(=O)N1CCOCC1
: