Target
Signal transducer and activator of transcription 1-alpha/beta
Ligand
BDBM46369
Substrate
Meas. Tech.
Dose response counterscreen assay for STAT3 inhibitors: cell-based high throughput assay to measure STAT1 inhibition
IC50
>55700±n/a nM
Citation
 PubChem, PC Dose response counterscreen assay for STAT3 inhibitors: cell-based high throughput assay to measure STAT1 inhibition PubChem Bioassay (2008)[AID] 
Target
Name:
Signal transducer and activator of transcription 1-alpha/beta
Synonyms:
STAT1 Signal transducer and activator of transcription 1-alpha/beta Transcription factor ISGF-3 components p91/p84 | signal transducer and activator of transcription 1 isoform alpha
Type:
Cytosolic Transcription Factor
Mol. Mass.:
87327.69
Organism:
Homo sapiens (Human)
Description:
Stat1 was expressed in sf9 cells from a baculovirus encoding the recombinant proteins. Stat1 dimer binds to DNA.
Residue:
750
  
Inhibitor
Name:
BDBM46369
Synonyms:
MLS000522242 N-[2-[(4-chlorophenyl)methyl]-1,3-benzoxazol-5-yl]-3,4-dimethoxy-benzamide SMR000127510 | cid_6737673
Type:
Small organic molecule
Emp. Form.:
C23H19ClN2O4
Mol. Mass.:
422.861
SMILES:
COc1ccc(cc1OC)C(=O)Nc1ccc2oc(Cc3ccc(Cl)cc3)nc2c1
: