Target
Signal transducer and activator of transcription 1-alpha/beta
Ligand
BDBM46396
Substrate
Meas. Tech.
Dose response counterscreen assay for STAT3 inhibitors: cell-based high throughput assay to measure STAT1 inhibition
IC50
45460±n/a nM
Citation
 PubChem, PC Dose response counterscreen assay for STAT3 inhibitors: cell-based high throughput assay to measure STAT1 inhibition PubChem Bioassay (2008)[AID] 
Target
Name:
Signal transducer and activator of transcription 1-alpha/beta
Synonyms:
STAT1 Signal transducer and activator of transcription 1-alpha/beta Transcription factor ISGF-3 components p91/p84 | signal transducer and activator of transcription 1 isoform alpha
Type:
Cytosolic Transcription Factor
Mol. Mass.:
87327.69
Organism:
Homo sapiens (Human)
Description:
Stat1 was expressed in sf9 cells from a baculovirus encoding the recombinant proteins. Stat1 dimer binds to DNA.
Residue:
750
  
Inhibitor
Name:
BDBM46396
Synonyms:
MLS000589892 N-(3-hydroxyphenyl)-N'-(2-pyridinyl)oxamide N-(3-hydroxyphenyl)-N'-pyridin-2-yl-ethanediamide SMR000217071 | cid_1898255
Type:
Small organic molecule
Emp. Form.:
C13H11N3O3
Mol. Mass.:
257.2447
SMILES:
Oc1cccc(NC(=O)C(=O)Nc2ccccn2)c1
: