Target
Signal transducer and activator of transcription 1-alpha/beta
Ligand
BDBM46413
Substrate
Meas. Tech.
Dose response counterscreen assay for STAT3 inhibitors: cell-based high throughput assay to measure STAT1 inhibition
IC50
>55700±n/a nM
Citation
 PubChem, PC Dose response counterscreen assay for STAT3 inhibitors: cell-based high throughput assay to measure STAT1 inhibition PubChem Bioassay (2008)[AID] 
Target
Name:
Signal transducer and activator of transcription 1-alpha/beta
Synonyms:
STAT1 Signal transducer and activator of transcription 1-alpha/beta Transcription factor ISGF-3 components p91/p84 | signal transducer and activator of transcription 1 isoform alpha
Type:
Cytosolic Transcription Factor
Mol. Mass.:
87327.69
Organism:
Homo sapiens (Human)
Description:
Stat1 was expressed in sf9 cells from a baculovirus encoding the recombinant proteins. Stat1 dimer binds to DNA.
Residue:
750
  
Inhibitor
Name:
BDBM46413
Synonyms:
2-benzyl-5-(4-bromophenyl)pyrazol-3-amine 5-(4-bromophenyl)-2-(phenylmethyl)pyrazol-3-amine SMR000282133 cid_693933
Type:
Small organic molecule
Emp. Form.:
C16H14BrN3
Mol. Mass.:
328.206
SMILES:
Nc1cc(nn1Cc1ccccc1)-c1ccc(Br)cc1
: