Target
Alkaline phosphatase, germ cell type
Ligand
BDBM50309570
Substrate
Meas. Tech.
Luminescent assay for HTS discovery of chemical inhibitors of placental alkaline phosphatase confirmation
IC50
4730±n/a nM
Citation
 PubChem, PC Luminescent assay for HTS discovery of chemical inhibitors of placental alkaline phosphatase confirmation PubChem Bioassay (2009)[AID] 
Target
Name:
Alkaline phosphatase, germ cell type
Synonyms:
ALPG ALPPL2 PPBN_HUMAN | placental-like alkaline phosphatase preproprotein
Type:
PROTEIN
Mol. Mass.:
57374.31
Organism:
Homo sapiens (Human)
Description:
ChEMBL_29964
Residue:
532
  
Inhibitor
Name:
BDBM50309570
Synonyms:
1-(3,4-dihydroxyphenyl)-2-(4-methyl-5-phenyl-4H-1,2,4-triazol-3-ylthio)ethanone cid_838842
Type:
Small organic molecule
Emp. Form.:
C17H15N3O3S
Mol. Mass.:
341.384
SMILES:
Cn1c(SCC(=O)c2ccc(O)c(O)c2)nnc1-c1ccccc1
: