Target
Alkaline phosphatase, germ cell type
Ligand
BDBM39783
Substrate
Meas. Tech.
Luminescent assay for HTS discovery of chemical inhibitors of placental alkaline phosphatase confirmation
IC50
2850±n/a nM
Citation
 PubChem, PC Luminescent assay for HTS discovery of chemical inhibitors of placental alkaline phosphatase confirmation PubChem Bioassay (2009)[AID] 
Target
Name:
Alkaline phosphatase, germ cell type
Synonyms:
ALPG ALPPL2 PPBN_HUMAN | placental-like alkaline phosphatase preproprotein
Type:
PROTEIN
Mol. Mass.:
57374.31
Organism:
Homo sapiens (Human)
Description:
ChEMBL_29964
Residue:
532
  
Inhibitor
Name:
BDBM39783
Synonyms:
2-(2,4-dichlorostyryl)-1H-1,3-benzimidazole 2-[(E)-2-(2,4-dichlorophenyl)vinyl]-1H-benzimidazole SMR000169722 | cid_6050443
Type:
Small organic molecule
Emp. Form.:
C15H10Cl2N2
Mol. Mass.:
289.159
SMILES:
Clc1ccc(\C=C\c2nc3ccccc3[nH]2)c(Cl)c1
: