Target
E3 ubiquitin-protein ligase XIAP
Ligand
BDBM43779
Substrate
Meas. Tech.
Counter Screen using XIAP-Bir3 of the Chemical Antagonists of IAP-family anti-apoptotic proteins confirmation assay
IC50
>200000±0 nM
Citation
 PubChem, PC Counter Screen using XIAP-Bir3 of the Chemical Antagonists of IAP-family anti-apoptotic proteins confirmation assay PubChem Bioassay (2009)[AID] 
Target
Name:
E3 ubiquitin-protein ligase XIAP
Synonyms:
API3 E3 ubiquitin-protein ligase XIAP Inhibitor of apoptosis protein 3 X-linked inhibitor of apoptosis XIAP | XIAP_HUMAN
Type:
Protein
Mol. Mass.:
56685.27
Organism:
Homo sapiens (Human)
Description:
P98170
Residue:
497
  
Inhibitor
Name:
BDBM43779
Synonyms:
(2S)-2-(1-ketoisoindolin-2-yl)-3-phenyl-propionic acid (2S)-2-(3-oxo-1H-isoindol-2-yl)-3-phenylpropanoic acid SMR000097543 | cid_5309580
Type:
Small organic molecule
Emp. Form.:
C17H15NO3
Mol. Mass.:
281.3059
SMILES:
OC(=O)[C@H](Cc1ccccc1)N1Cc2ccccc2C1=O
: