Target
Eukaryotic translation initiation factor 2-alpha kinase 3
Ligand
BDBM46470
Substrate
Meas. Tech.
Dose response cell-based high-throughput screening assay to measure PERK inhibition
EC50
>55700±n/a nM
Citation
 PubChem, PC Dose response cell-based high-throughput screening assay to measure PERK inhibition PubChem Bioassay (2009)[AID] 
Target
Name:
Eukaryotic translation initiation factor 2-alpha kinase 3
Synonyms:
E2AK3_HUMAN HsPEK PERK Pancreatic endoplasmic reticulum kinase (PERK)
Type:
Enzyme
Mol. Mass.:
125190.66
Organism:
Homo sapiens (Human)
Description:
Q9NZJ5
Residue:
1116
  
Inhibitor
Name:
BDBM46470
Synonyms:
2-(3-nitro-1,2,4-triazol-1-yl)-N'-[(E)-(6-oxidanylidenecyclohexa-2,4-dien-1-ylidene)methyl]ethanehydrazide 2-(3-nitro-1,2,4-triazol-1-yl)-N'-[(E)-(6-oxocyclohexa-2,4-dien-1-ylidene)methyl]acetohydrazide N'-(2-hydroxybenzylidene)-2-{3-nitro-1H-1,2,4-triazol-1-yl}acetohydrazide SMR000161884 | cid_6537566
Type:
Small organic molecule
Emp. Form.:
C11H10N6O4
Mol. Mass.:
290.2349
SMILES:
[O-][N+](=O)c1ncn(CC(=O)N\[NH+]=C\[c-]2ccccc2=O)n1
: