Target
Eukaryotic translation initiation factor 2-alpha kinase 3
Ligand
BDBM46451
Substrate
Meas. Tech.
Counterscreen assay for PERK inhibitors: Dose response cell-based high throughput screening assay to measure inhibition of PERK at 6 hours
EC50
>55700±n/a nM
Citation
 PubChem, PC Counterscreen assay for PERK inhibitors: Dose response cell-based high throughput screening assay to measure inhibition of PERK at 6 hours PubChem Bioassay (2009)[AID] 
Target
Name:
Eukaryotic translation initiation factor 2-alpha kinase 3
Synonyms:
E2AK3_HUMAN HsPEK PERK Pancreatic endoplasmic reticulum kinase (PERK)
Type:
Enzyme
Mol. Mass.:
125190.66
Organism:
Homo sapiens (Human)
Description:
Q9NZJ5
Residue:
1116
  
Inhibitor
Name:
BDBM46451
Synonyms:
MLS000103017 N-(2-fluorophenyl)-2-(3-methyl-2-methylimino-4-oxo-1,3-thiazolidin-5-yl)acetamide N-(2-fluorophenyl)-2-(4-keto-3-methyl-2-methylimino-thiazolidin-5-yl)acetamide cid_3441571
Type:
Small organic molecule
Emp. Form.:
C13H14FN3O2S
Mol. Mass.:
295.333
SMILES:
C\N=C1\SC(CC(=O)Nc2ccccc2F)C(=O)N1C
: