Target
Eukaryotic translation initiation factor 2-alpha kinase 3
Ligand
BDBM46531
Substrate
Meas. Tech.
Counterscreen assay for PERK inhibitors: Dose response cell-based high throughput screening assay to measure inhibition of PERK at 6 hours
EC50
>55700±n/a nM
Citation
 PubChem, PC Counterscreen assay for PERK inhibitors: Dose response cell-based high throughput screening assay to measure inhibition of PERK at 6 hours PubChem Bioassay (2009)[AID] 
Target
Name:
Eukaryotic translation initiation factor 2-alpha kinase 3
Synonyms:
E2AK3_HUMAN HsPEK PERK Pancreatic endoplasmic reticulum kinase (PERK)
Type:
Enzyme
Mol. Mass.:
125190.66
Organism:
Homo sapiens (Human)
Description:
Q9NZJ5
Residue:
1116
  
Inhibitor
Name:
BDBM46531
Synonyms:
3-(2-methyl-4-nitro-1-imidazolyl)propanenitrile 3-(2-methyl-4-nitro-imidazol-1-yl)propanenitrile 3-(2-methyl-4-nitroimidazol-1-yl)propanenitrile SMR000457330 | cid_319755
Type:
Small organic molecule
Emp. Form.:
C7H8N4O2
Mol. Mass.:
180.164
SMILES:
Cc1nc(cn1CCC#N)[N+]([O-])=O
: