Target
Eukaryotic translation initiation factor 2-alpha kinase 3
Ligand
BDBM46543
Substrate
Meas. Tech.
Counterscreen assay for PERK inhibitors: Dose response cell-based high throughput screening assay to measure inhibition of PERK at 6 hours
EC50
>55700±n/a nM
Citation
 PubChem, PC Counterscreen assay for PERK inhibitors: Dose response cell-based high throughput screening assay to measure inhibition of PERK at 6 hours PubChem Bioassay (2009)[AID] 
Target
Name:
Eukaryotic translation initiation factor 2-alpha kinase 3
Synonyms:
E2AK3_HUMAN HsPEK PERK Pancreatic endoplasmic reticulum kinase (PERK)
Type:
Enzyme
Mol. Mass.:
125190.66
Organism:
Homo sapiens (Human)
Description:
Q9NZJ5
Residue:
1116
  
Inhibitor
Name:
BDBM46543
Synonyms:
3-(2-{[4-(tert-butyl)benzoyl]oxy}phenyl)propanoic acid 3-[2-(4-tert-butylbenzoyl)oxyphenyl]propionic acid 3-[2-[(4-tert-butylphenyl)-oxomethoxy]phenyl]propanoic acid SMR000456836 | cid_2732578
Type:
Small organic molecule
Emp. Form.:
C20H22O4
Mol. Mass.:
326.3863
SMILES:
CC(C)(C)c1ccc(cc1)C(=O)Oc1ccccc1CCC(O)=O
: