Target
Transitional endoplasmic reticulum ATPase
Ligand
BDBM22857
Substrate
Meas. Tech.
Dose response biochemical high throughput screening assay for inhibitors of the p97 ATPase
IC50
>50000±n/a nM
Citation
 PubChem, PC Dose response biochemical high throughput screening assay for inhibitors of the p97 ATPase PubChem Bioassay (2009)[AID] 
Target
Name:
Transitional endoplasmic reticulum ATPase
Synonyms:
TERA_HUMAN VCP Valosin-containing protein
Type:
Enzyme
Mol. Mass.:
89300.63
Organism:
Homo sapiens (Human)
Description:
P55072
Residue:
806
  
Inhibitor
Name:
BDBM22857
Synonyms:
1,2-Dione-Based Compound, 14 CHEMBL51931 cid_6763
Type:
Small organic molecule
Emp. Form.:
C14H8O2
Mol. Mass.:
208.2121
SMILES:
O=C1C(=O)c2ccccc2-c2ccccc12
: