Target
Transitional endoplasmic reticulum ATPase
Ligand
BDBM46574
Substrate
Meas. Tech.
Dose response biochemical high throughput screening assay for inhibitors of the p97 ATPase
IC50
>50000±n/a nM
Citation
 PubChem, PC Dose response biochemical high throughput screening assay for inhibitors of the p97 ATPase PubChem Bioassay (2009)[AID] 
Target
Name:
Transitional endoplasmic reticulum ATPase
Synonyms:
TERA_HUMAN VCP Valosin-containing protein
Type:
Enzyme
Mol. Mass.:
89300.63
Organism:
Homo sapiens (Human)
Description:
P55072
Residue:
806
  
Inhibitor
Name:
BDBM46574
Synonyms:
2-chloranyl-1-(2-methyl-1H-indol-3-yl)ethanone MLS000718557 cid_723221
Type:
Small organic molecule
Emp. Form.:
C11H10ClNO
Mol. Mass.:
207.656
SMILES:
Cc1[nH]c2ccccc2c1C(=O)CCl
: