Target
Mannose-6-phosphate isomerase
Ligand
BDBM38366
Substrate
Meas. Tech.
Confirmation of compounds inhibiting phosphomannose isomerase (PMI) via a fluorescence intensity assay.
IC50
>50000±n/a nM
Citation
 PubChem, PC Confirmation of compounds inhibiting phosphomannose isomerase (PMI) via a fluorescence intensity assay. PubChem Bioassay (2010)[AID] 
Target
Name:
Mannose-6-phosphate isomerase
Synonyms:
MPI MPI_HUMAN PMI1
Type:
PROTEIN
Mol. Mass.:
46651.35
Organism:
Homo sapiens (Human)
Description:
ChEMBL_1448919
Residue:
423
  
Inhibitor
Name:
BDBM38366
Synonyms:
2-(4-piperidin-1-ylsulfonylphenyl)-1,2-benzothiazol-3-one 2-[4-(1-piperidinylsulfonyl)phenyl]-1,2-benzothiazol-3-one SMR000060795 | cid_2327941
Type:
Small organic molecule
Emp. Form.:
C18H18N2O3S2
Mol. Mass.:
374.477
SMILES:
O=c1n(sc2ccccc12)-c1ccc(cc1)S(=O)(=O)N1CCCCC1
: