Target
Mannose-6-phosphate isomerase
Ligand
BDBM34340
Substrate
Meas. Tech.
Confirmation of compounds inhibiting phosphomannose isomerase (PMI) via a fluorescence intensity assay.
IC50
3060±n/a nM
Citation
 PubChem, PC Confirmation of compounds inhibiting phosphomannose isomerase (PMI) via a fluorescence intensity assay. PubChem Bioassay (2010)[AID] 
Target
Name:
Mannose-6-phosphate isomerase
Synonyms:
MPI MPI_HUMAN PMI1
Type:
PROTEIN
Mol. Mass.:
46651.35
Organism:
Homo sapiens (Human)
Description:
ChEMBL_1448919
Residue:
423
  
Inhibitor
Name:
BDBM34340
Synonyms:
2-(4-methyl-3-piperidin-1-ylsulfonyl-phenyl)-1,2-benzothiazol-3-one 2-(4-methyl-3-piperidinosulfonyl-phenyl)-1,2-benzothiazol-3-one MLS000057572 cid_2327953
Type:
Small organic molecule
Emp. Form.:
C19H20N2O3S2
Mol. Mass.:
388.504
SMILES:
Cc1ccc(cc1S(=O)(=O)N1CCCCC1)-n1sc2ccccc2c1=O
: